Latest solver - building on Windows

classic Classic list List threaded Threaded
1 message Options
Reply | Threaded
Open this post in threaded view
|

Latest solver - building on Windows

KAMI911
Hi!

I would like to help out Kohei with a Windows build of solver but I get
this error during building scsolver:

41) : error C2027: use of undefined type
'boost::numeric::ublas::matrix_binary<E
1,E2,F>::const_iterator2'
       
c:\203\solver\680\wntmsci10.pro\inc\boost\numeric\ublas\matrix_expressio
n.hpp(1980) : see declaration of
'boost::numeric::ublas::matrix_binary<E1,E2,F>:
:const_iterator2'
c:\203\solver\680\wntmsci10.pro\inc\boost\numeric\ublas\matrix_expression.hpp(28
11) : error C2027: use of undefined type
'boost::numeric::ublas::matrix_binary_s
calar1<E1,E2,F>::const_iterator2'
       
c:\203\solver\680\wntmsci10.pro\inc\boost\numeric\ublas\matrix_expressio
n.hpp(2692) : see declaration of
'boost::numeric::ublas::matrix_binary_scalar1<E
1,E2,F>::const_iterator2'
       
c:\203\solver\680\wntmsci10.pro\inc\boost\numeric\ublas\matrix_expressio
n.hpp(2745) : see reference to class template instantiation
'boost::numeric::ubl
as::matrix_binary_scalar1<E1,E2,F>::const_iterator1' being compiled
       
c:\203\solver\680\wntmsci10.pro\inc\boost\numeric\ublas\matrix_expressio
n.hpp(3033) : see reference to class template instantiation
'boost::numeric::ubl
as::matrix_binary_scalar1<E1,E2,F>' being compiled
c:\203\solver\680\wntmsci10.pro\inc\boost\numeric\ublas\matrix_expression.hpp(28
15) : error C2027: use of undefined type
'boost::numeric::ublas::matrix_binary_s
calar1<E1,E2,F>::const_iterator2'
       
c:\203\solver\680\wntmsci10.pro\inc\boost\numeric\ublas\matrix_expressio
n.hpp(2692) : see declaration of
'boost::numeric::ublas::matrix_binary_scalar1<E
1,E2,F>::const_iterator2'
c:\203\solver\680\wntmsci10.pro\inc\boost\numeric\ublas\matrix_expression.hpp(32
43) : error C2027: use of undefined type
'boost::numeric::ublas::matrix_binary_s
calar2<E1,E2,F>::const_iterator2'
       
c:\203\solver\680\wntmsci10.pro\inc\boost\numeric\ublas\matrix_expressio
n.hpp(3124) : see declaration of
'boost::numeric::ublas::matrix_binary_scalar2<E
1,E2,F>::const_iterator2'
       
c:\203\solver\680\wntmsci10.pro\inc\boost\numeric\ublas\matrix_expressio
n.hpp(3177) : see reference to class template instantiation
'boost::numeric::ubl
as::matrix_binary_scalar2<E1,E2,F>::const_iterator1' being compiled
       
c:\203\solver\680\wntmsci10.pro\inc\boost\numeric\ublas\matrix_expressio
n.hpp(3465) : see reference to class template instantiation
'boost::numeric::ubl
as::matrix_binary_scalar2<E1,E2,F>' being compiled
c:\203\solver\680\wntmsci10.pro\inc\boost\numeric\ublas\matrix_expression.hpp(32
47) : error C2027: use of undefined type
'boost::numeric::ublas::matrix_binary_s
calar2<E1,E2,F>::const_iterator2'
       
c:\203\solver\680\wntmsci10.pro\inc\boost\numeric\ublas\matrix_expressio
n.hpp(3124) : see declaration of
'boost::numeric::ublas::matrix_binary_scalar2<E
1,E2,F>::const_iterator2'
c:\203\solver\680\wntmsci10.pro\inc\boost\numeric\ublas\matrix_expression.hpp(45
33) : error C2027: use of undefined type
'boost::numeric::ublas::matrix_matrix_b
inary<E1,E2,F>::const_iterator2'
       
c:\203\solver\680\wntmsci10.pro\inc\boost\numeric\ublas\matrix_expressio
n.hpp(4338) : see declaration of
'boost::numeric::ublas::matrix_matrix_binary<E1
,E2,F>::const_iterator2'
       
c:\203\solver\680\wntmsci10.pro\inc\boost\numeric\ublas\matrix_expressio
n.hpp(4410) : see reference to class template instantiation
'boost::numeric::ubl
as::matrix_matrix_binary<E1,E2,F>::const_iterator1' being compiled
       
c:\203\solver\680\wntmsci10.pro\inc\boost\numeric\ublas\matrix_expressio
n.hpp(4826) : see reference to class template instantiation
'boost::numeric::ubl
as::matrix_matrix_binary<E1,E2,F>' being compiled
c:\203\solver\680\wntmsci10.pro\inc\boost\numeric\ublas\matrix_expression.hpp(45
37) : error C2027: use of undefined type
'boost::numeric::ublas::matrix_matrix_b
inary<E1,E2,F>::const_iterator2'
       
c:\203\solver\680\wntmsci10.pro\inc\boost\numeric\ublas\matrix_expressio
n.hpp(4338) : see declaration of
'boost::numeric::ublas::matrix_matrix_binary<E1
,E2,F>::const_iterator2'
c:\203\solver\680\wntmsci10.pro\inc\boost\numeric\ublas\matrix_proxy.hpp(3001)
:
 error C2027: use of undefined type
'boost::numeric::ublas::matrix_range<M>::con
st_iterator2'
       
c:\203\solver\680\wntmsci10.pro\inc\boost\numeric\ublas\matrix_proxy.hpp
(2841) : see declaration of
'boost::numeric::ublas::matrix_range<M>::const_itera
tor2'
       
c:\203\solver\680\wntmsci10.pro\inc\boost\numeric\ublas\matrix_proxy.hpp
(2933) : see reference to class template instantiation
'boost::numeric::ublas::m
atrix_range<M>::const_iterator1' being compiled
       
c:\203\solver\680\wntmsci10.pro\inc\boost\numeric\ublas\matrix_proxy.hpp
(3497) : see reference to class template instantiation
'boost::numeric::ublas::m
atrix_range<M>' being compiled
c:\203\solver\680\wntmsci10.pro\inc\boost\numeric\ublas\matrix_proxy.hpp(3006)
:
 error C2027: use of undefined type
'boost::numeric::ublas::matrix_range<M>::con
st_iterator2'
       
c:\203\solver\680\wntmsci10.pro\inc\boost\numeric\ublas\matrix_proxy.hpp
(2841) : see declaration of
'boost::numeric::ublas::matrix_range<M>::const_itera
tor2'
c:\203\solver\680\wntmsci10.pro\inc\boost\numeric\ublas\matrix_proxy.hpp(3129)
:
 error C2027: use of undefined type
'boost::numeric::ublas::matrix_range<M>::ite
rator2'
       
c:\203\solver\680\wntmsci10.pro\inc\boost\numeric\ublas\matrix_proxy.hpp
(2842) : see declaration of
'boost::numeric::ublas::matrix_range<M>::iterator2'
       
c:\203\solver\680\wntmsci10.pro\inc\boost\numeric\ublas\matrix_proxy.hpp
(3064) : see reference to class template instantiation
'boost::numeric::ublas::m
atrix_range<M>::iterator1' being compiled
c:\203\solver\680\wntmsci10.pro\inc\boost\numeric\ublas\matrix_proxy.hpp(3134)
:
 error C2027: use of undefined type
'boost::numeric::ublas::matrix_range<M>::ite
rator2'
       
c:\203\solver\680\wntmsci10.pro\inc\boost\numeric\ublas\matrix_proxy.hpp
(2842) : see declaration of
'boost::numeric::ublas::matrix_range<M>::iterator2'
c:\203\solver\680\wntmsci10.pro\inc\boost\numeric\ublas\matrix_proxy.hpp(3909)
:
 error C2027: use of undefined type
'boost::numeric::ublas::matrix_slice<M>::con
st_iterator2'
       
c:\203\solver\680\wntmsci10.pro\inc\boost\numeric\ublas\matrix_proxy.hpp
(3761) : see declaration of
'boost::numeric::ublas::matrix_slice<M>::const_itera
tor2'
       
c:\203\solver\680\wntmsci10.pro\inc\boost\numeric\ublas\matrix_proxy.hpp
(3845) : see reference to class template instantiation
'boost::numeric::ublas::m
atrix_slice<M>::const_iterator1' being compiled
       
c:\203\solver\680\wntmsci10.pro\inc\boost\numeric\ublas\matrix_proxy.hpp
(4401) : see reference to class template instantiation
'boost::numeric::ublas::m
atrix_slice<M>' being compiled
c:\203\solver\680\wntmsci10.pro\inc\boost\numeric\ublas\matrix_proxy.hpp(3913)
:
 error C2027: use of undefined type
'boost::numeric::ublas::matrix_slice<M>::con
st_iterator2'
       
c:\203\solver\680\wntmsci10.pro\inc\boost\numeric\ublas\matrix_proxy.hpp
(3761) : see declaration of
'boost::numeric::ublas::matrix_slice<M>::const_itera
tor2'
c:\203\solver\680\wntmsci10.pro\inc\boost\numeric\ublas\matrix_proxy.hpp(4035)
:
 error C2027: use of undefined type
'boost::numeric::ublas::matrix_slice<M>::ite
rator2'
       
c:\203\solver\680\wntmsci10.pro\inc\boost\numeric\ublas\matrix_proxy.hpp
(3762) : see declaration of
'boost::numeric::ublas::matrix_slice<M>::iterator2'
       
c:\203\solver\680\wntmsci10.pro\inc\boost\numeric\ublas\matrix_proxy.hpp
(3974) : see reference to class template instantiation
'boost::numeric::ublas::m
atrix_slice<M>::iterator1' being compiled
c:\203\solver\680\wntmsci10.pro\inc\boost\numeric\ublas\matrix_proxy.hpp(4039)
:
 error C2027: use of undefined type
'boost::numeric::ublas::matrix_slice<M>::ite
rator2'
       
c:\203\solver\680\wntmsci10.pro\inc\boost\numeric\ublas\matrix_proxy.hpp
(3762) : see declaration of
'boost::numeric::ublas::matrix_slice<M>::iterator2'
c:\203\solver\680\wntmsci10.pro\inc\boost\numeric\ublas\matrix_proxy.hpp(4819)
:
 error C2027: use of undefined type
'boost::numeric::ublas::matrix_indirect<M,IA
 >::const_iterator2'
       
c:\203\solver\680\wntmsci10.pro\inc\boost\numeric\ublas\matrix_proxy.hpp
(4671) : see declaration of
'boost::numeric::ublas::matrix_indirect<M,IA>::const
_iterator2'
       
c:\203\solver\680\wntmsci10.pro\inc\boost\numeric\ublas\matrix_proxy.hpp
(4755) : see reference to class template instantiation
'boost::numeric::ublas::m
atrix_indirect<M,IA>::const_iterator1' being compiled
       
c:\203\solver\680\wntmsci10.pro\inc\boost\numeric\ublas\matrix_proxy.hpp
(5311) : see reference to class template instantiation
'boost::numeric::ublas::m
atrix_indirect<M,IA>' being compiled
c:\203\solver\680\wntmsci10.pro\inc\boost\numeric\ublas\matrix_proxy.hpp(4823)
:
 error C2027: use of undefined type
'boost::numeric::ublas::matrix_indirect<M,IA
 >::const_iterator2'
       
c:\203\solver\680\wntmsci10.pro\inc\boost\numeric\ublas\matrix_proxy.hpp
(4671) : see declaration of
'boost::numeric::ublas::matrix_indirect<M,IA>::const
_iterator2'
c:\203\solver\680\wntmsci10.pro\inc\boost\numeric\ublas\matrix_proxy.hpp(4945)
:
 error C2027: use of undefined type
'boost::numeric::ublas::matrix_indirect<M,IA
 >::iterator2'
       
c:\203\solver\680\wntmsci10.pro\inc\boost\numeric\ublas\matrix_proxy.hpp
(4672) : see declaration of
'boost::numeric::ublas::matrix_indirect<M,IA>::itera
tor2'
       
c:\203\solver\680\wntmsci10.pro\inc\boost\numeric\ublas\matrix_proxy.hpp
(4884) : see reference to class template instantiation
'boost::numeric::ublas::m
atrix_indirect<M,IA>::iterator1' being compiled
c:\203\solver\680\wntmsci10.pro\inc\boost\numeric\ublas\matrix_proxy.hpp(4949)
:
 error C2027: use of undefined type
'boost::numeric::ublas::matrix_indirect<M,IA
 >::iterator2'
       
c:\203\solver\680\wntmsci10.pro\inc\boost\numeric\ublas\matrix_proxy.hpp
(4672) : see declaration of
'boost::numeric::ublas::matrix_indirect<M,IA>::itera
tor2'
c:\203\solver\680\wntmsci10.pro\inc\boost\numeric\ublas\matrix.hpp(405)
: error
C2027: use of undefined type
'boost::numeric::ublas::matrix<T,F,A>::const_iterat
or2'
       
c:\203\solver\680\wntmsci10.pro\inc\boost\numeric\ublas\matrix.hpp(257)
: see declaration of 'boost::numeric::ublas::matrix<T,F,A>::const_iterator2'
       
c:\203\solver\680\wntmsci10.pro\inc\boost\numeric\ublas\matrix.hpp(341)
: see reference to class template instantiation
'boost::numeric::ublas::matrix<T
,F,A>::const_iterator1' being compiled
       
c:\203\solver\680\wntmsci10.pro\inc\boost\numeric\ublas\matrix.hpp(896)
: see reference to class template instantiation
'boost::numeric::ublas::matrix<T
,F,A>' being compiled
c:\203\solver\680\wntmsci10.pro\inc\boost\numeric\ublas\matrix.hpp(410)
: error
C2027: use of undefined type
'boost::numeric::ublas::matrix<T,F,A>::const_iterat
or2'
       
c:\203\solver\680\wntmsci10.pro\inc\boost\numeric\ublas\matrix.hpp(257)
: see declaration of 'boost::numeric::ublas::matrix<T,F,A>::const_iterator2'
c:\203\solver\680\wntmsci10.pro\inc\boost\numeric\ublas\matrix.hpp(531)
: error
C2027: use of undefined type
'boost::numeric::ublas::matrix<T,F,A>::iterator2'
       
c:\203\solver\680\wntmsci10.pro\inc\boost\numeric\ublas\matrix.hpp(258)
: see declaration of 'boost::numeric::ublas::matrix<T,F,A>::iterator2'
       
c:\203\solver\680\wntmsci10.pro\inc\boost\numeric\ublas\matrix.hpp(472)
: see reference to class template instantiation
'boost::numeric::ublas::matrix<T
,F,A>::iterator1' being compiled
c:\203\solver\680\wntmsci10.pro\inc\boost\numeric\ublas\matrix.hpp(536)
: error
C2027: use of undefined type
'boost::numeric::ublas::matrix<T,F,A>::iterator2'
       
c:\203\solver\680\wntmsci10.pro\inc\boost\numeric\ublas\matrix.hpp(258)
: see declaration of 'boost::numeric::ublas::matrix<T,F,A>::iterator2'
c:\203\solver\680\wntmsci10.pro\inc\boost\numeric\ublas\matrix.hpp(1294)
: error
 C2027: use of undefined type
'boost::numeric::ublas::vector_of_vector<T,F,A>::c
onst_iterator2'
       
c:\203\solver\680\wntmsci10.pro\inc\boost\numeric\ublas\matrix.hpp(1131)
 : see declaration of
'boost::numeric::ublas::vector_of_vector<T,F,A>::const_ite
rator2'
       
c:\203\solver\680\wntmsci10.pro\inc\boost\numeric\ublas\matrix.hpp(1215)
 : see reference to class template instantiation
'boost::numeric::ublas::vector_
of_vector<T,F,A>::const_iterator1' being compiled
       
c:\203\solver\680\wntmsci10.pro\inc\boost\numeric\ublas\matrix.hpp(1838)
 : see reference to class template instantiation
'boost::numeric::ublas::vector_
of_vector<T,F,A>' being compiled
c:\203\solver\680\wntmsci10.pro\inc\boost\numeric\ublas\matrix.hpp(1299)
: error
 C2027: use of undefined type
'boost::numeric::ublas::vector_of_vector<T,F,A>::c
onst_iterator2'
       
c:\203\solver\680\wntmsci10.pro\inc\boost\numeric\ublas\matrix.hpp(1131)
 : see declaration of
'boost::numeric::ublas::vector_of_vector<T,F,A>::const_ite
rator2'
c:\203\solver\680\wntmsci10.pro\inc\boost\numeric\ublas\matrix.hpp(1437)
: error
 C2027: use of undefined type
'boost::numeric::ublas::vector_of_vector<T,F,A>::i
terator2'
       
c:\203\solver\680\wntmsci10.pro\inc\boost\numeric\ublas\matrix.hpp(1132)
 : see declaration of
'boost::numeric::ublas::vector_of_vector<T,F,A>::iterator2
'
       
c:\203\solver\680\wntmsci10.pro\inc\boost\numeric\ublas\matrix.hpp(1363)
 : see reference to class template instantiation
'boost::numeric::ublas::vector_
of_vector<T,F,A>::iterator1' being compiled
c:\203\solver\680\wntmsci10.pro\inc\boost\numeric\ublas\matrix.hpp(1442)
: error
 C2027: use of undefined type
'boost::numeric::ublas::vector_of_vector<T,F,A>::i
terator2'
       
c:\203\solver\680\wntmsci10.pro\inc\boost\numeric\ublas\matrix.hpp(1132)
 : see declaration of
'boost::numeric::ublas::vector_of_vector<T,F,A>::iterator2
'
c:\203\solver\680\wntmsci10.pro\inc\boost\numeric\ublas\matrix.hpp(2060)
: error
 C2027: use of undefined type
'boost::numeric::ublas::identity_matrix<T>::const_
iterator2'
       
c:\203\solver\680\wntmsci10.pro\inc\boost\numeric\ublas\matrix.hpp(1951)
 : see declaration of
'boost::numeric::ublas::identity_matrix<T>::const_iterator
2'
       
c:\203\solver\680\wntmsci10.pro\inc\boost\numeric\ublas\matrix.hpp(1998)
 : see reference to class template instantiation
'boost::numeric::ublas::identit
y_matrix<T>::const_iterator1' being compiled
       
c:\203\solver\680\wntmsci10.pro\inc\boost\numeric\ublas\matrix.hpp(2284)
 : see reference to class template instantiation
'boost::numeric::ublas::identit
y_matrix<T>' being compiled
c:\203\solver\680\wntmsci10.pro\inc\boost\numeric\ublas\matrix.hpp(2065)
: error
 C2027: use of undefined type
'boost::numeric::ublas::identity_matrix<T>::const_
iterator2'
       
c:\203\solver\680\wntmsci10.pro\inc\boost\numeric\ublas\matrix.hpp(1951)
 : see declaration of
'boost::numeric::ublas::identity_matrix<T>::const_iterator
2'
c:\203\solver\680\wntmsci10.pro\inc\boost\numeric\ublas\matrix.hpp(2503)
: error
 C2027: use of undefined type
'boost::numeric::ublas::zero_matrix<T>::const_iter
ator2'
       
c:\203\solver\680\wntmsci10.pro\inc\boost\numeric\ublas\matrix.hpp(2402)
 : see declaration of
'boost::numeric::ublas::zero_matrix<T>::const_iterator2'
       
c:\203\solver\680\wntmsci10.pro\inc\boost\numeric\ublas\matrix.hpp(2441)
 : see reference to class template instantiation
'boost::numeric::ublas::zero_ma
trix<T>::const_iterator1' being compiled
       
c:\203\solver\680\wntmsci10.pro\inc\boost\numeric\ublas\matrix.hpp(2720)
 : see reference to class template instantiation
'boost::numeric::ublas::zero_ma
trix<T>' being compiled
c:\203\solver\680\wntmsci10.pro\inc\boost\numeric\ublas\matrix.hpp(2508)
: error
 C2027: use of undefined type
'boost::numeric::ublas::zero_matrix<T>::const_iter
ator2'
       
c:\203\solver\680\wntmsci10.pro\inc\boost\numeric\ublas\matrix.hpp(2402)
 : see declaration of
'boost::numeric::ublas::zero_matrix<T>::const_iterator2'
c:\203\solver\680\wntmsci10.pro\inc\boost\numeric\ublas\matrix.hpp(2931)
: error
 C2027: use of undefined type
'boost::numeric::ublas::scalar_matrix<T>::const_it
erator2'
       
c:\203\solver\680\wntmsci10.pro\inc\boost\numeric\ublas\matrix.hpp(2830)
 : see declaration of
'boost::numeric::ublas::scalar_matrix<T>::const_iterator2'

       
c:\203\solver\680\wntmsci10.pro\inc\boost\numeric\ublas\matrix.hpp(2869)
 : see reference to class template instantiation
'boost::numeric::ublas::scalar_
matrix<T>::const_iterator1' being compiled
       
c:\203\solver\680\wntmsci10.pro\inc\boost\numeric\ublas\matrix.hpp(3154)
 : see reference to class template instantiation
'boost::numeric::ublas::scalar_
matrix<T>' being compiled
c:\203\solver\680\wntmsci10.pro\inc\boost\numeric\ublas\matrix.hpp(2936)
: error
 C2027: use of undefined type
'boost::numeric::ublas::scalar_matrix<T>::const_it
erator2'
       
c:\203\solver\680\wntmsci10.pro\inc\boost\numeric\ublas\matrix.hpp(2830)
 : see declaration of
'boost::numeric::ublas::scalar_matrix<T>::const_iterator2'

c:\203\solver\680\wntmsci10.pro\inc\boost\numeric\ublas\matrix.hpp(3545)
: error
 C2027: use of undefined type
'boost::numeric::ublas::c_matrix<T,N,M>::const_ite
rator2'
       
c:\203\solver\680\wntmsci10.pro\inc\boost\numeric\ublas\matrix.hpp(3397)
 : see declaration of
'boost::numeric::ublas::c_matrix<T,N,M>::const_iterator2'
       
c:\203\solver\680\wntmsci10.pro\inc\boost\numeric\ublas\matrix.hpp(3481)
 : see reference to class template instantiation
'boost::numeric::ublas::c_matri
x<T,N,M>::const_iterator1' being compiled
       
c:\203\solver\680\wntmsci10.pro\inc\boost\numeric\ublas\matrix.hpp(4036)
 : see reference to class template instantiation
'boost::numeric::ublas::c_matri
x<T,N,M>' being compiled
c:\203\solver\680\wntmsci10.pro\inc\boost\numeric\ublas\matrix.hpp(3550)
: error
 C2027: use of undefined type
'boost::numeric::ublas::c_matrix<T,N,M>::const_ite
rator2'
       
c:\203\solver\680\wntmsci10.pro\inc\boost\numeric\ublas\matrix.hpp(3397)
 : see declaration of
'boost::numeric::ublas::c_matrix<T,N,M>::const_iterator2'
c:\203\solver\680\wntmsci10.pro\inc\boost\numeric\ublas\matrix.hpp(3671)
: error
 C2027: use of undefined type
'boost::numeric::ublas::c_matrix<T,N,M>::iterator2
'
       
c:\203\solver\680\wntmsci10.pro\inc\boost\numeric\ublas\matrix.hpp(3398)
 : see declaration of 'boost::numeric::ublas::c_matrix<T,N,M>::iterator2'
       
c:\203\solver\680\wntmsci10.pro\inc\boost\numeric\ublas\matrix.hpp(3612)
 : see reference to class template instantiation
'boost::numeric::ublas::c_matri
x<T,N,M>::iterator1' being compiled
c:\203\solver\680\wntmsci10.pro\inc\boost\numeric\ublas\matrix.hpp(3676)
: error
 C2027: use of undefined type
'boost::numeric::ublas::c_matrix<T,N,M>::iterator2
'
       
c:\203\solver\680\wntmsci10.pro\inc\boost\numeric\ublas\matrix.hpp(3398)
 : see declaration of 'boost::numeric::ublas::c_matrix<T,N,M>::iterator2'
dmake:  Error code 2, while making '../../wntmsci10.pro/slo/lpbuilder.obj'
---* tg_merge.mk *---

ERROR: Error 65280 occurred while making /cygdrive/c/203/scsolver/source/ui
[ooo@winooobuilder ...203/scsolver]$

Thanks,
KAMI

---------------------------------------------------------------------
To unsubscribe, e-mail: [hidden email]
For additional commands, e-mail: [hidden email]