error when building progect sal

classic Classic list List threaded Threaded
2 messages Options
Reply | Threaded
Open this post in threaded view
|

error when building progect sal

Yurkov Vyacheslav
I'm sorry for incomplete information that I gave before (I forgot about
redirection stderr ;)!
My OS is Slackware 10, gcc-3.3.4

=============
Building project sal
=============
/mnt/oo/OOo_2.0.0rc3_src/sal/typesconfig
-------------
/mnt/oo/OOo_2.0.0rc3_src/sal/osl/all
-------------
/mnt/oo/OOo_2.0.0rc3_src/sal/osl/unx
-------------
/mnt/oo/OOo_2.0.0rc3_src/sal/rtl/source
--- ALWAYSDBGFILES ---
`../../unxlngi4.pro/slo/debugprint.obj' is up to date
--- ALWAYSDBGFILES OVER ---
-------------
/mnt/oo/OOo_2.0.0rc3_src/sal/systools/macxp_extras/x11osx
Nothing to build for OS LINUX
/mnt/oo/OOo_2.0.0rc3_src/sal/textenc
-------------
/mnt/oo/OOo_2.0.0rc3_src/sal/util
------------------------------
Making: ../unxlngi4.pro/lib/libsalalloc_malloc.so.3
gcc -z combreloc -z defs -Wl,-rpath,'$ORIGIN'
"-Wl,-hlibsalalloc_malloc.so.3" -shared -Wl,-O1 -Wl,--version-script
../unxlngi4.pro/misc/salalloc_salalloc_malloc.map -L../unxlngi4.pro/lib
-L../lib -L/mnt/oo/OOo_2.0.0rc3_src/solenv/unxlngi4/lib
-L/mnt/oo/OOo_2.0.0rc3_src/solver/680/unxlngi4.pro/lib
-L/mnt/oo/OOo_2.0.0rc3_src/solenv/unxlngi4/lib -L/usr/lib/java/lib
-L/usr/lib/java/jre/lib/i386 -L/usr/lib/java/jre/lib/i386/client
-L/usr/lib/java/jre/lib/i386/native_threads -L/usr/X11R6/lib
../unxlngi4.pro/slo/salalloc_malloc_version.o
../unxlngi4.pro/slo/salalloc_malloc_description.o -o
../unxlngi4.pro/lib/libsalalloc_malloc.so.3
../unxlngi4.pro/slo/SYSALLOC_alloc.o -ldl -lpthread -lm
rm -f ../unxlngi4.pro/lib/check_libsalalloc_malloc.so.3
mv ../unxlngi4.pro/lib/libsalalloc_malloc.so.3
../unxlngi4.pro/lib/check_libsalalloc_malloc.so.3
/mnt/oo/OOo_2.0.0rc3_src/solenv/bin/checkdll.sh -L../unxlngi4.pro/lib
-L../lib -L/mnt/oo/OOo_2.0.0rc3_src/solenv/unxlngi4/lib
-L/mnt/oo/OOo_2.0.0rc3_src/solver/680/unxlngi4.pro/lib
-L/mnt/oo/OOo_2.0.0rc3_src/solenv/unxlngi4/lib -L/usr/lib/java/lib
-L/usr/lib/java/jre/lib/i386 -L/usr/lib/java/jre/lib/i386/client
-L/usr/lib/java/jre/lib/i386/native_threads -L/usr/X11R6/lib
../unxlngi4.pro/lib/check_libsalalloc_malloc.so.3
Checking DLL ../unxlngi4.pro/lib/check_libsalalloc_malloc.so.3
.../mnt/oo/OOo_2.0.0rc3_src/solenv/bin/checkdll.sh: line 67:  7705
Segmentation fault      $checkdll "$*"
dmake:  Error code 1, while making
'../unxlngi4.pro/lib/libsalalloc_malloc.so.3'
'---* tg_merge.mk *---'

ERROR: Error 65280 occurred while making /mnt/oo/OOo_2.0.0rc3_src/sal/util
dmake:  Error code 1, while making 'build_instsetoo_native'
'---* tg_merge.mk *---'

--
If my english isn't correct, please tell me where, cause I just study!


This file contains any messages produced by compilers while
running configure, to aid debugging if configure makes a mistake.

It was created by configure, which was
generated by GNU Autoconf 2.59.  Invocation command line was

  $ ./configure --enable-kde --enable-build-mozilla --with-ant-home=/usr/local/apache-ant-1.6.5 --with-lang=ru en-US --with-dict=RURU,ENGB,ENUS

## --------- ##
## Platform. ##
## --------- ##

hostname = uvv
uname -m = i686
uname -r = 2.6.14-mm1
uname -s = Linux
uname -v = #6 SMP Wed Nov 9 12:45:21 KRAT 2005

/usr/bin/uname -p = unknown
/bin/uname -X     = unknown

/bin/arch              = i686
/usr/bin/arch -k       = unknown
/usr/convex/getsysinfo = unknown
hostinfo               = unknown
/bin/machine           = unknown
/usr/bin/oslevel       = unknown
/bin/universe          = unknown

PATH: /usr/sbin
PATH: /sbin
PATH: /usr/bin
PATH: /bin
PATH: /usr/X11R6/bin
PATH: /usr/games
PATH: /usr/lib/java/bin
PATH: /usr/lib/java/jre/bin
PATH: /opt/kde/bin
PATH: /usr/lib/qt/bin
PATH: /usr/share/texmf/bin


## ----------- ##
## Core tests. ##
## ----------- ##

configure:2333: checking for gawk
configure:2349: found /usr/bin/gawk
configure:2359: result: gawk
configure:2371: checking for gawk
configure:2389: found /usr/bin/gawk
configure:2401: result: /usr/bin/gawk
configure:2418: checking for sed
configure:2436: found /usr/bin/sed
configure:2448: result: /usr/bin/sed
configure:2464: checking for solenv environment
configure:2468: result: default
configure:2526: checking build system type
configure:2544: result: i686-pc-linux-gnu
configure:2552: checking host system type
configure:2566: result: i686-pc-linux-gnu
configure:2574: checking target system type
configure:2588: result: i686-pc-linux-gnu
configure:2745: checking whether to enable crashdump feature
configure:2765: result: no
configure:2804: checking whether to do a debug build
configure:2815: result: no
configure:2820: checking whether to build with additional debug utilities
configure:2832: result: no, full product build
configure:2839: checking whether to include symbols into final build
configure:2861: result: no
configure:2867: checking whether to enable native CUPS support
configure:2871: result: yes
configure:2880: checking whether to enable fontconfig support
configure:2884: result: yes
configure:2893: checking whether to enable filters for legacy binary file formats (StarOffice 5.2)
configure:2902: result: yes
configure:2935: checking whether to use RPATH in shared libraries
configure:2942: result: yes
configure:2946: checking whether to include MySpell dictionaries
configure:2949: result: yes
configure:2960: checking which shell to use
configure:2995: result: tcsh
configure:3003: checking for tcsh
configure:3021: found /bin/tcsh
configure:3033: result: /bin/tcsh
configure:3054: checking gcc home
configure:3061: result: /usr
configure:3118: checking for gcc
configure:3134: found /usr/bin/gcc
configure:3144: result: gcc
configure:3388: checking for C compiler version
configure:3391: gcc --version </dev/null >&5
gcc (GCC) 3.3.4
Copyright (C) 2003 Free Software Foundation, Inc.
This is free software; see the source for copying conditions.  There is NO
warranty; not even for MERCHANTABILITY or FITNESS FOR A PARTICULAR PURPOSE.

configure:3394: $? = 0
configure:3396: gcc -v </dev/null >&5
Reading specs from /usr/lib/gcc-lib/i486-slackware-linux/3.3.4/specs
Configured with: ../gcc-3.3.4/configure --prefix=/usr --enable-shared --enable-threads=posix --enable-__cxa_atexit --disable-checking --with-gnu-ld --verbose --target=i486-slackware-linux --host=i486-slackware-linux
Thread model: posix
gcc version 3.3.4
configure:3399: $? = 0
configure:3401: gcc -V </dev/null >&5
gcc: `-V' option must have argument
configure:3404: $? = 1
configure:3427: checking for C compiler default output file name
configure:3430: gcc    conftest.c  >&5
configure:3433: $? = 0
configure:3479: result: a.out
configure:3484: checking whether the C compiler works
configure:3490: ./a.out
configure:3493: $? = 0
configure:3510: result: yes
configure:3517: checking whether we are cross compiling
configure:3519: result: no
configure:3522: checking for suffix of executables
configure:3524: gcc -o conftest    conftest.c  >&5
configure:3527: $? = 0
configure:3552: result:
configure:3558: checking for suffix of object files
configure:3579: gcc -c   conftest.c >&5
configure:3582: $? = 0
configure:3604: result: o
configure:3608: checking whether we are using the GNU C compiler
configure:3632: gcc -c   conftest.c >&5
configure:3638: $? = 0
configure:3642: test -z
                         || test ! -s conftest.err
configure:3645: $? = 0
configure:3648: test -s conftest.o
configure:3651: $? = 0
configure:3664: result: yes
configure:3670: checking whether gcc accepts -g
configure:3691: gcc -c -g  conftest.c >&5
configure:3697: $? = 0
configure:3701: test -z
                         || test ! -s conftest.err
configure:3704: $? = 0
configure:3707: test -s conftest.o
configure:3710: $? = 0
configure:3721: result: yes
configure:3738: checking for gcc option to accept ANSI C
configure:3808: gcc  -c -g -O2  conftest.c >&5
configure:3814: $? = 0
configure:3818: test -z
                         || test ! -s conftest.err
configure:3821: $? = 0
configure:3824: test -s conftest.o
configure:3827: $? = 0
configure:3845: result: none needed
configure:3863: gcc -c -g -O2  conftest.c >&5
conftest.c:2: error: parse error before "me"
configure:3869: $? = 1
configure: failed program was:
| #ifndef __cplusplus
|   choke me
| #endif
configure:4010: checking for gcc
configure:4028: found /usr/bin/gcc
configure:4040: result: /usr/bin/gcc
configure:4055: checking the GNU gcc compiler version
configure:4075: result: checked (gcc 3.3.4)
configure:4092: checking whether gcc supports -fvisibility=hidden
configure:4113: gcc -o conftest -g -O2 -fvisibility=hidden   conftest.c  >&5
cc1: error: unrecognized option `-fvisibility=hidden'
configure:4119: $? = 1
configure: failed program was:
| /* confdefs.h.  */
|
| #define PACKAGE_NAME ""
| #define PACKAGE_TARNAME ""
| #define PACKAGE_VERSION ""
| #define PACKAGE_STRING ""
| #define PACKAGE_BUGREPORT ""
| /* end confdefs.h.  */
|
| int
| main ()
| {
|  return 0;
|   ;
|   return 0;
| }
configure:4147: result: no
configure:4153: checking for GNU make
configure:4162: result: make
configure:4165: checking the GNU make version
configure:4175: result: make 3.80
configure:4767: checking how to run the C preprocessor
configure:4802: gcc -E  conftest.c
configure:4808: $? = 0
configure:4840: gcc -E  conftest.c
conftest.c:9:28: ac_nonexistent.h: No such file or directory
configure:4846: $? = 1
configure: failed program was:
| /* confdefs.h.  */
|
| #define PACKAGE_NAME ""
| #define PACKAGE_TARNAME ""
| #define PACKAGE_VERSION ""
| #define PACKAGE_STRING ""
| #define PACKAGE_BUGREPORT ""
| /* end confdefs.h.  */
| #include <ac_nonexistent.h>
configure:4885: result: gcc -E
configure:4909: gcc -E  conftest.c
configure:4915: $? = 0
configure:4947: gcc -E  conftest.c
conftest.c:9:28: ac_nonexistent.h: No such file or directory
configure:4953: $? = 1
configure: failed program was:
| /* confdefs.h.  */
|
| #define PACKAGE_NAME ""
| #define PACKAGE_TARNAME ""
| #define PACKAGE_VERSION ""
| #define PACKAGE_STRING ""
| #define PACKAGE_BUGREPORT ""
| /* end confdefs.h.  */
| #include <ac_nonexistent.h>
configure:4997: checking for egrep
configure:5007: result: grep -E
configure:5012: checking for ANSI C header files
configure:5037: gcc -c -g -O2  conftest.c >&5
configure:5043: $? = 0
configure:5047: test -z
                         || test ! -s conftest.err
configure:5050: $? = 0
configure:5053: test -s conftest.o
configure:5056: $? = 0
configure:5142: gcc -o conftest -g -O2   conftest.c  >&5
configure:5145: $? = 0
configure:5147: ./conftest
configure:5150: $? = 0
configure:5165: result: yes
configure:5192: checking for sys/types.h
configure:5208: gcc -c -g -O2  conftest.c >&5
configure:5214: $? = 0
configure:5218: test -z
                         || test ! -s conftest.err
configure:5221: $? = 0
configure:5224: test -s conftest.o
configure:5227: $? = 0
configure:5238: result: yes
configure:5192: checking for sys/stat.h
configure:5208: gcc -c -g -O2  conftest.c >&5
configure:5214: $? = 0
configure:5218: test -z
                         || test ! -s conftest.err
configure:5221: $? = 0
configure:5224: test -s conftest.o
configure:5227: $? = 0
configure:5238: result: yes
configure:5192: checking for stdlib.h
configure:5208: gcc -c -g -O2  conftest.c >&5
configure:5214: $? = 0
configure:5218: test -z
                         || test ! -s conftest.err
configure:5221: $? = 0
configure:5224: test -s conftest.o
configure:5227: $? = 0
configure:5238: result: yes
configure:5192: checking for string.h
configure:5208: gcc -c -g -O2  conftest.c >&5
configure:5214: $? = 0
configure:5218: test -z
                         || test ! -s conftest.err
configure:5221: $? = 0
configure:5224: test -s conftest.o
configure:5227: $? = 0
configure:5238: result: yes
configure:5192: checking for memory.h
configure:5208: gcc -c -g -O2  conftest.c >&5
configure:5214: $? = 0
configure:5218: test -z
                         || test ! -s conftest.err
configure:5221: $? = 0
configure:5224: test -s conftest.o
configure:5227: $? = 0
configure:5238: result: yes
configure:5192: checking for strings.h
configure:5208: gcc -c -g -O2  conftest.c >&5
configure:5214: $? = 0
configure:5218: test -z
                         || test ! -s conftest.err
configure:5221: $? = 0
configure:5224: test -s conftest.o
configure:5227: $? = 0
configure:5238: result: yes
configure:5192: checking for inttypes.h
configure:5208: gcc -c -g -O2  conftest.c >&5
configure:5214: $? = 0
configure:5218: test -z
                         || test ! -s conftest.err
configure:5221: $? = 0
configure:5224: test -s conftest.o
configure:5227: $? = 0
configure:5238: result: yes
configure:5192: checking for stdint.h
configure:5208: gcc -c -g -O2  conftest.c >&5
configure:5214: $? = 0
configure:5218: test -z
                         || test ! -s conftest.err
configure:5221: $? = 0
configure:5224: test -s conftest.o
configure:5227: $? = 0
configure:5238: result: yes
configure:5192: checking for unistd.h
configure:5208: gcc -c -g -O2  conftest.c >&5
configure:5214: $? = 0
configure:5218: test -z
                         || test ! -s conftest.err
configure:5221: $? = 0
configure:5224: test -s conftest.o
configure:5227: $? = 0
configure:5238: result: yes
configure:5260: checking cups/cups.h usability
configure:5272: gcc -c -g -O2  conftest.c >&5
configure:5278: $? = 0
configure:5282: test -z
                         || test ! -s conftest.err
configure:5285: $? = 0
configure:5288: test -s conftest.o
configure:5291: $? = 0
configure:5301: result: yes
configure:5305: checking cups/cups.h presence
configure:5315: gcc -E  conftest.c
configure:5321: $? = 0
configure:5341: result: yes
configure:5376: checking for cups/cups.h
configure:5383: result: yes
configure:5409: checking security/pam_appl.h usability
configure:5421: gcc -c -g -O2  conftest.c >&5
configure:5427: $? = 0
configure:5431: test -z
                         || test ! -s conftest.err
configure:5434: $? = 0
configure:5437: test -s conftest.o
configure:5440: $? = 0
configure:5450: result: yes
configure:5454: checking security/pam_appl.h presence
configure:5464: gcc -E  conftest.c
configure:5470: $? = 0
configure:5490: result: yes
configure:5525: checking for security/pam_appl.h
configure:5532: result: yes
configure:5545: checking whether to link to libpam
configure:5630: result: no, dynamically open it
configure:5638: checking whether to link to libcrypt
configure:5641: result: yes
configure:5645: checking for crypt in -lcrypt
configure:5675: gcc -o conftest -g -O2   conftest.c -lcrypt   >&5
configure:5681: $? = 0
configure:5685: test -z
                         || test ! -s conftest.err
configure:5688: $? = 0
configure:5691: test -s conftest
configure:5694: $? = 0
configure:5707: result: yes
configure:5795: checking for g++
configure:5811: found /usr/bin/g++
configure:5821: result: g++
configure:5837: checking for C++ compiler version
configure:5840: g++ --version </dev/null >&5
g++ (GCC) 3.3.4
Copyright (C) 2003 Free Software Foundation, Inc.
This is free software; see the source for copying conditions.  There is NO
warranty; not even for MERCHANTABILITY or FITNESS FOR A PARTICULAR PURPOSE.

configure:5843: $? = 0
configure:5845: g++ -v </dev/null >&5
Reading specs from /usr/lib/gcc-lib/i486-slackware-linux/3.3.4/specs
Configured with: ../gcc-3.3.4/configure --prefix=/usr --enable-shared --enable-threads=posix --enable-__cxa_atexit --disable-checking --with-gnu-ld --verbose --target=i486-slackware-linux --host=i486-slackware-linux
Thread model: posix
gcc version 3.3.4
configure:5848: $? = 0
configure:5850: g++ -V </dev/null >&5
g++: `-V' option must have argument
configure:5853: $? = 1
configure:5856: checking whether we are using the GNU C++ compiler
configure:5880: g++ -c   conftest.cc >&5
configure:5886: $? = 0
configure:5890: test -z
                         || test ! -s conftest.err
configure:5893: $? = 0
configure:5896: test -s conftest.o
configure:5899: $? = 0
configure:5912: result: yes
configure:5918: checking whether g++ accepts -g
configure:5939: g++ -c -g  conftest.cc >&5
configure:5945: $? = 0
configure:5949: test -z
                         || test ! -s conftest.err
configure:5952: $? = 0
configure:5955: test -s conftest.o
configure:5958: $? = 0
configure:5969: result: yes
configure:6011: g++ -c -g -O2  conftest.cc >&5
configure:6017: $? = 0
configure:6021: test -z
                         || test ! -s conftest.err
configure:6024: $? = 0
configure:6027: test -s conftest.o
configure:6030: $? = 0
configure:6056: g++ -c -g -O2  conftest.cc >&5
conftest.cc: In function `int main()':
conftest.cc:24: error: `exit' undeclared (first use this function)
conftest.cc:24: error: (Each undeclared identifier is reported only once for
   each function it appears in.)
configure:6062: $? = 1
configure: failed program was:
| /* confdefs.h.  */
|
| #define PACKAGE_NAME ""
| #define PACKAGE_TARNAME ""
| #define PACKAGE_VERSION ""
| #define PACKAGE_STRING ""
| #define PACKAGE_BUGREPORT ""
| #define STDC_HEADERS 1
| #define HAVE_SYS_TYPES_H 1
| #define HAVE_SYS_STAT_H 1
| #define HAVE_STDLIB_H 1
| #define HAVE_STRING_H 1
| #define HAVE_MEMORY_H 1
| #define HAVE_STRINGS_H 1
| #define HAVE_INTTYPES_H 1
| #define HAVE_STDINT_H 1
| #define HAVE_UNISTD_H 1
| #define HAVE_LIBCRYPT 1
| /* end confdefs.h.  */
|
| int
| main ()
| {
| exit (42);
|   ;
|   return 0;
| }
configure:6011: g++ -c -g -O2  conftest.cc >&5
configure:6017: $? = 0
configure:6021: test -z
                         || test ! -s conftest.err
configure:6024: $? = 0
configure:6027: test -s conftest.o
configure:6030: $? = 0
configure:6056: g++ -c -g -O2  conftest.cc >&5
configure:6062: $? = 0
configure:6066: test -z
                         || test ! -s conftest.err
configure:6069: $? = 0
configure:6072: test -s conftest.o
configure:6075: $? = 0
configure:6101: checking the GNU C++ compiler version
configure:6108: result: checked (g++ 3.3.4)
configure:6183: checking for g++ include path
configure:6197: result: /usr/include/c++/3.3.4
configure:6260: checking exception type
configure:6294: g++ -o conftest -g -O2   conftest.cc -lcrypt  >&5
/tmp/cc2V67yf.o(.text+0xa): In function `main':
/mnt/oo/OOo_2.0.0rc3_src/config_office/conftest.cc:31: undefined reference to `__sjthrow'
collect2: ld returned 1 exit status
configure:6300: $? = 1
configure: failed program was:
| /* confdefs.h.  */
|
| #define PACKAGE_NAME ""
| #define PACKAGE_TARNAME ""
| #define PACKAGE_VERSION ""
| #define PACKAGE_STRING ""
| #define PACKAGE_BUGREPORT ""
| #define STDC_HEADERS 1
| #define HAVE_SYS_TYPES_H 1
| #define HAVE_SYS_STAT_H 1
| #define HAVE_STDLIB_H 1
| #define HAVE_STRING_H 1
| #define HAVE_MEMORY_H 1
| #define HAVE_STRINGS_H 1
| #define HAVE_INTTYPES_H 1
| #define HAVE_STDINT_H 1
| #define HAVE_UNISTD_H 1
| #define HAVE_LIBCRYPT 1
| #ifdef __cplusplus
| extern "C" void std::exit (int) throw (); using std::exit;
| #endif
| /* end confdefs.h.  */
| #include <iostream>
|
| extern "C" void __sjthrow(void) __attribute__ ((__noreturn__));
|
|
| int
| main ()
| {
| __sjthrow()
|   ;
|   return 0;
| }
configure:6328: result: dwarf2
configure:6729: checking for STLport4 headers
configure:6734: result: using internal stlport.
configure:6920: checking whether to add custom build version
configure:6928: result: no
configure:6933: checking whether to build with Java support
configure:6936: result: yes
configure:6972: checking for java
configure:6990: found /usr/lib/java/bin/java
configure:7002: result: /usr/lib/java/bin/java
configure:7029: checking the installed JDK
configure:7105: result: checked (JDK 1.4.2_04)
configure:7130: checking for javac
configure:7148: found /usr/lib/java/bin/javac
configure:7160: result: /usr/lib/java/bin/javac
configure:7191: checking for javadoc
configure:7209: found /usr/lib/java/bin/javadoc
configure:7221: result: /usr/lib/java/bin/javadoc
configure:7747: checking how to run the C preprocessor
configure:7865: result: gcc -E
configure:7889: gcc -E  conftest.c
configure:7895: $? = 0
configure:7927: gcc -E  conftest.c
conftest.c:23:28: ac_nonexistent.h: No such file or directory
configure:7933: $? = 1
configure: failed program was:
| /* confdefs.h.  */
|
| #define PACKAGE_NAME ""
| #define PACKAGE_TARNAME ""
| #define PACKAGE_VERSION ""
| #define PACKAGE_STRING ""
| #define PACKAGE_BUGREPORT ""
| #define STDC_HEADERS 1
| #define HAVE_SYS_TYPES_H 1
| #define HAVE_SYS_STAT_H 1
| #define HAVE_STDLIB_H 1
| #define HAVE_STRING_H 1
| #define HAVE_MEMORY_H 1
| #define HAVE_STRINGS_H 1
| #define HAVE_INTTYPES_H 1
| #define HAVE_STDINT_H 1
| #define HAVE_UNISTD_H 1
| #define HAVE_LIBCRYPT 1
| #ifdef __cplusplus
| extern "C" void std::exit (int) throw (); using std::exit;
| #endif
| /* end confdefs.h.  */
| #include <ac_nonexistent.h>
configure:7983: checking how to run the C++ preprocessor
configure:8014: g++ -E  conftest.cc
configure:8020: $? = 0
configure:8052: g++ -E  conftest.cc
conftest.cc:23:28: ac_nonexistent.h: No such file or directory
configure:8058: $? = 1
configure: failed program was:
| /* confdefs.h.  */
|
| #define PACKAGE_NAME ""
| #define PACKAGE_TARNAME ""
| #define PACKAGE_VERSION ""
| #define PACKAGE_STRING ""
| #define PACKAGE_BUGREPORT ""
| #define STDC_HEADERS 1
| #define HAVE_SYS_TYPES_H 1
| #define HAVE_SYS_STAT_H 1
| #define HAVE_STDLIB_H 1
| #define HAVE_STRING_H 1
| #define HAVE_MEMORY_H 1
| #define HAVE_STRINGS_H 1
| #define HAVE_INTTYPES_H 1
| #define HAVE_STDINT_H 1
| #define HAVE_UNISTD_H 1
| #define HAVE_LIBCRYPT 1
| #ifdef __cplusplus
| extern "C" void std::exit (int) throw (); using std::exit;
| #endif
| /* end confdefs.h.  */
| #include <ac_nonexistent.h>
configure:8097: result: g++ -E
configure:8121: g++ -E  conftest.cc
configure:8127: $? = 0
configure:8159: g++ -E  conftest.cc
conftest.cc:23:28: ac_nonexistent.h: No such file or directory
configure:8165: $? = 1
configure: failed program was:
| /* confdefs.h.  */
|
| #define PACKAGE_NAME ""
| #define PACKAGE_TARNAME ""
| #define PACKAGE_VERSION ""
| #define PACKAGE_STRING ""
| #define PACKAGE_BUGREPORT ""
| #define STDC_HEADERS 1
| #define HAVE_SYS_TYPES_H 1
| #define HAVE_SYS_STAT_H 1
| #define HAVE_STDLIB_H 1
| #define HAVE_STRING_H 1
| #define HAVE_MEMORY_H 1
| #define HAVE_STRINGS_H 1
| #define HAVE_INTTYPES_H 1
| #define HAVE_STDINT_H 1
| #define HAVE_UNISTD_H 1
| #define HAVE_LIBCRYPT 1
| #ifdef __cplusplus
| extern "C" void std::exit (int) throw (); using std::exit;
| #endif
| /* end confdefs.h.  */
| #include <ac_nonexistent.h>
configure:8213: checking for perl
configure:8231: found /usr/bin/perl
configure:8243: result: /usr/bin/perl
configure:8262: checking the Perl version
configure:8271: result: checked (perl 5)
configure:8280: checking for required Perl modules
configure:8283: result: all modules found
configure:8293: checking for dmake
configure:8324: result: no
configure:8377: checking whether to enable EPM for packing
configure:8380: result: yes
configure:8388: checking for epm
configure:8419: result: no
configure:8479: checking which package format to use
configure:8567: result: rpm
configure:8570: checking for rpm
configure:8585: result: /usr/bin/rpmbuild
configure:8748: checking whether to build the ODK
configure:8751: result: yes
configure:8759: checking whether to build qadevOOo
configure:8762: result: yes
configure:8770: checking whether to provide libstdc++/libgcc_s in the installset
configure:8778: result: yes
configure:8784: checking which zlib to use
configure:9010: result: internal
configure:9017: checking which jpeg to use
configure:9242: result: internal
configure:9249: checking which expat to use
configure:9480: result: internal
configure:9487: checking which freetype to use
configure:9593: result: internal
configure:9602: checking which libwpd to use
configure:9708: result: internal
configure:9717: checking which libxml to use
configure:9824: result: internal
configure:9833: checking which python to use
configure:10072: result: internal
configure:10079: checking which db to use
configure:10429: result: internal
configure:10438: checking which sablot to use
configure:10494: result: internal
configure:10501: checking which curl to use
configure:10570: result: internal
configure:10579: checking which boost to use
configure:10878: result: internal
configure:10885: checking which odbc headers to use
configure:11039: result: internal
configure:11046: checking whether to enable build of Mozilla/Mozilla NSS-using components
configure:11053: result: yes
configure:11059: checking whether to build Mozilla addressbook connectivity
configure:11068: result: yes
configure:11072: checking whether to build XML Security support
configure:11081: result: yes
configure:11085: checking whether to build LDAP configuration backend
configure:11096: result: yes
configure:11102: checking which LDAP SDK to use
configure:11421: result: Netscape/Mozilla
configure:11430: checking which mozilla to use
configure:11746: result: internal
configure:11764: checking for toolkit which mozilla should use
configure:11768: result: gtk2
configure:11780: checking whether to build Mozilla
configure:11784: result: yes
configure:11801: checking for mozilla-source-1.7.5.tar.gz
configure:11814: result: found
configure:11852: checking for pkg-config
configure:11870: found /usr/bin/pkg-config
configure:11883: result: /usr/bin/pkg-config
configure:11900: checking for gtk+-2.0
configure:11904: result: yes
configure:11908: checking MOZLIBREQ_CFLAGS
configure:11911: result: -I/usr/include/gtk-2.0 -I/usr/lib/gtk-2.0/include -I/usr/include/atk-1.0 -I/usr/include/pango-1.0 -I/usr/X11R6/include -I/usr/include/freetype2 -I/usr/include/glib-2.0 -I/usr/lib/glib-2.0/include  
configure:11914: checking MOZLIBREQ_LIBS
configure:11917: result: -Wl,--export-dynamic -lgtk-x11-2.0 -lgdk-x11-2.0 -latk-1.0 -lgdk_pixbuf-2.0 -lm -lpangoxft-1.0 -lpangox-1.0 -lpango-1.0 -lgobject-2.0 -lgmodule-2.0 -ldl -lglib-2.0  
configure:12001: checking for libIDL-2.0 >= 0.8.0
configure:12005: result: yes
configure:12009: checking MOZLIBREQ_CFLAGS
configure:12012: result: -I/usr/include/libIDL-2.0 -I/usr/include/glib-2.0 -I/usr/lib/glib-2.0/include  
configure:12015: checking MOZLIBREQ_LIBS
configure:12018: result: -lIDL-2 -lglib-2.0  
configure:12265: checking which sane header to use
configure:12418: result: internal
configure:12468: checking for X
configure:12698: result: libraries /usr/X11R6/lib, headers /usr/X11R6/include
configure:12870: g++ -o conftest -g -O2   conftest.cc -lcrypt   -L/usr/X11R6/lib -lX11 >&5
configure:12876: $? = 0
configure:12880: test -z
                         || test ! -s conftest.err
configure:12883: $? = 0
configure:12886: test -s conftest
configure:12889: $? = 0
configure:13047: checking for gethostbyname
configure:13104: g++ -o conftest -g -O2   conftest.cc -lcrypt  >&5
configure:13110: $? = 0
configure:13114: test -z
                         || test ! -s conftest.err
configure:13117: $? = 0
configure:13120: test -s conftest
configure:13123: $? = 0
configure:13135: result: yes
configure:13286: checking for connect
configure:13343: g++ -o conftest -g -O2   conftest.cc -lcrypt  >&5
configure:13349: $? = 0
configure:13353: test -z
                         || test ! -s conftest.err
configure:13356: $? = 0
configure:13359: test -s conftest
configure:13362: $? = 0
configure:13374: result: yes
configure:13449: checking for remove
configure:13506: g++ -o conftest -g -O2   conftest.cc -lcrypt  >&5
configure:13512: $? = 0
configure:13516: test -z
                         || test ! -s conftest.err
configure:13519: $? = 0
configure:13522: test -s conftest
configure:13525: $? = 0
configure:13537: result: yes
configure:13612: checking for shmat
configure:13669: g++ -o conftest -g -O2   conftest.cc -lcrypt  >&5
configure:13675: $? = 0
configure:13679: test -z
                         || test ! -s conftest.err
configure:13682: $? = 0
configure:13685: test -s conftest
configure:13688: $? = 0
configure:13700: result: yes
configure:13784: checking for IceConnectionNumber in -lICE
configure:13814: g++ -o conftest -g -O2   -L/usr/X11R6/lib conftest.cc -lICE  -lcrypt  >&5
configure:13820: $? = 0
configure:13824: test -z
                         || test ! -s conftest.err
configure:13827: $? = 0
configure:13830: test -s conftest
configure:13833: $? = 0
configure:13846: result: yes
configure:13871: checking X11/Xaw/Label.h usability
configure:13883: g++ -c -g -O2   -I/usr/X11R6/include conftest.cc >&5
configure:13889: $? = 0
configure:13893: test -z
                         || test ! -s conftest.err
configure:13896: $? = 0
configure:13899: test -s conftest.o
configure:13902: $? = 0
configure:13912: result: yes
configure:13916: checking X11/Xaw/Label.h presence
configure:13926: g++ -E   -I/usr/X11R6/include conftest.cc
configure:13932: $? = 0
configure:13952: result: yes
configure:13987: checking for X11/Xaw/Label.h
configure:13994: result: yes
configure:14030: checking for XOpenDisplay in -lX11
configure:14060: g++ -o conftest -g -O2   -I/usr/X11R6/include   -L/usr/X11R6/lib conftest.cc -lX11  -lcrypt  >&5
configure:14066: $? = 0
configure:14070: test -z
                         || test ! -s conftest.err
configure:14073: $? = 0
configure:14076: test -s conftest
configure:14079: $? = 0
configure:14092: result: yes
configure:14128: checking fontconfig/fontconfig.h usability
configure:14140: g++ -c -g -O2   -I/usr/X11R6/include conftest.cc >&5
configure:14146: $? = 0
configure:14150: test -z
                         || test ! -s conftest.err
configure:14153: $? = 0
configure:14156: test -s conftest.o
configure:14159: $? = 0
configure:14169: result: yes
configure:14173: checking fontconfig/fontconfig.h presence
configure:14183: g++ -E   -I/usr/X11R6/include conftest.cc
configure:14189: $? = 0
configure:14209: result: yes
configure:14244: checking for fontconfig/fontconfig.h
configure:14251: result: yes
configure:14264: checking whether fontconfig is >= 2.2.0
configure:14289: g++ -o conftest -g -O2   -I/usr/X11R6/include   -L/usr/X11R6/lib conftest.cc -lcrypt  >&5
configure:14292: $? = 0
configure:14294: ./conftest
configure:14297: $? = 0
configure:14299: result: yes
configure:14315: checking whether to link to Xrender
configure:14323: result: no, dynamically open it
configure:14327: checking which Xrender headers to use
configure:14480: result: internal
configure:14568: checking which nas to use
configure:14776: result: internal
configure:14786: checking for xmkmf
configure:14804: found /usr/X11R6/bin/xmkmf
configure:14816: result: /usr/X11R6/bin/xmkmf
configure:14837: checking whether to enable portaudio/sndfile support
configure:14841: result: yes
configure:14844: checking which sndfile to use
configure:15076: result: internal
configure:15081: checking which portaudio to use
configure:15375: result: internal
configure:15389: checking which neon to use
configure:15496: result: internal
configure:15507: checking which myspell to use
configure:15838: result: internal
configure:15847: checking which altlinuxhyph to use
configure:16189: result: internal
configure:16195: checking which mythes to use
configure:16420: result: internal
configure:16427: checking whether libc is >= 2.1.1
configure:16430: checking for gnu_get_libc_version in -lc
configure:16460: g++ -o conftest -g -O2   -I/usr/X11R6/include   -L/usr/X11R6/lib conftest.cc -lc  -lcrypt  >&5
configure:16466: $? = 0
configure:16470: test -z
                         || test ! -s conftest.err
configure:16473: $? = 0
configure:16476: test -s conftest
configure:16479: $? = 0
configure:16492: result: yes
configure:16500: result: yes
configure:16704: checking for bison
configure:16722: found /usr/bin/bison
configure:16734: result: /usr/bin/bison
configure:16746: checking the bison version
configure:16757: result: checked (/usr/bin/bison 1.35)
configure:16768: checking for flex
configure:16786: found /usr/bin/flex
configure:16798: result: /usr/bin/flex
configure:16812: checking for patch
configure:16830: found /usr/bin/patch
configure:16842: result: /usr/bin/patch
configure:17029: checking for zip
configure:17047: found /usr/bin/zip
configure:17059: result: /usr/bin/zip
configure:17231: checking which polygon clipping code to use
configure:17370: result: internal
configure:17378: checking which VCLplugs shall be built
configure:17398: result: gtk kde
configure:17404: checking whether to enable GNOME VFS support
configure:17408: result: yes
configure:17464: checking for gnome-vfs-2.0 >= 2.6.0
configure:17468: result: yes
configure:17472: checking GNOMEVFS_CFLAGS
configure:17475: result: -pthread -DORBIT2=1 -I/usr/include/gnome-vfs-2.0 -I/usr/lib/gnome-vfs-2.0/include -I/usr/include/bonobo-activation-2.0 -I/usr/include/glib-2.0 -I/usr/lib/glib-2.0/include -I/usr/include/orbit-2.0  
configure:17478: checking GNOMEVFS_LIBS
configure:17481: result: -pthread -Wl,--export-dynamic -lgnomevfs-2 -lbonobo-activation -lORBit-2 -lgobject-2.0 -lm -lgmodule-2.0 -ldl -lgthread-2.0 -lglib-2.0  
configure:17562: checking for gconf-2.0
configure:17566: result: yes
configure:17570: checking GCONF_CFLAGS
configure:17573: result: -DORBIT2=1 -pthread -I/usr/include/gconf/2 -I/usr/include/orbit-2.0 -I/usr/include/glib-2.0 -I/usr/lib/glib-2.0/include  
configure:17576: checking GCONF_LIBS
configure:17579: result: -pthread -Wl,--export-dynamic -lgconf-2 -lORBit-2 -lgobject-2.0 -lm -lgmodule-2.0 -ldl -lgthread-2.0 -lglib-2.0  
configure:17672: checking for gtk+-2.0 >= 2.4
configure:17676: result: yes
configure:17680: checking GTK_CFLAGS
configure:17683: result: -I/usr/include/gtk-2.0 -I/usr/lib/gtk-2.0/include -I/usr/include/atk-1.0 -I/usr/include/pango-1.0 -I/usr/X11R6/include -I/usr/include/freetype2 -I/usr/include/glib-2.0 -I/usr/lib/glib-2.0/include  
configure:17686: checking GTK_LIBS
configure:17689: result: -Wl,--export-dynamic -lgtk-x11-2.0 -lgdk-x11-2.0 -latk-1.0 -lgdk_pixbuf-2.0 -lm -lpangoxft-1.0 -lpangox-1.0 -lpango-1.0 -lgobject-2.0 -lgmodule-2.0 -ldl -lglib-2.0  
configure:17770: checking for gdk-pixbuf-xlib-2.0 >= 2.2
configure:17774: result: yes
configure:17778: checking GDKPIXBUF_CFLAGS
configure:17781: result: -I/usr/include/gtk-2.0 -I/usr/include/glib-2.0 -I/usr/lib/glib-2.0/include  
configure:17784: checking GDKPIXBUF_LIBS
configure:17787: result: -Wl,--export-dynamic -lgdk_pixbuf_xlib-2.0 -lgdk_pixbuf-2.0 -lm -lgobject-2.0 -lgmodule-2.0 -ldl -lglib-2.0  
configure:17845: checking for Qt headers
configure:17854: result: /usr/lib/qt/include
configure:17864: checking for Qt libraries
configure:17873: result: /usr/lib/qt/lib
configure:17885: checking for moc
configure:17904: found /usr/lib/qt/bin/moc
configure:17917: result: /usr/lib/qt/bin/moc
configure:17932: checking for KDE headers
configure:17941: result: /opt/kde/include
configure:17951: checking for KDE libraries
configure:17960: result: /opt/kde/lib
configure:17977: checking whether to use libstartup-notification
configure:18083: result: no
configure:18090: checking whether to enable evolution 2 support
configure:18196: result: no
configure:18203: checking whether to include FontOOo
configure:18212: result: yes
configure:18226: checking whether to use system libmspack
configure:18458: result: no
configure:18465: checking whether to include MathMLDTD
configure:18473: result: yes
configure:18483: checking whether to include Bitstream Vera fonts
configure:18486: result: yes
configure:18500: checking whether and how to use Xinerama
configure:18536: result: yes, with static linking
configure:18548: checking X11/extensions/Xinerama.h usability
configure:18560: g++ -c -g -O2   -I/usr/X11R6/include conftest.cc >&5
In file included from conftest.cc:58:
/usr/X11R6/include/X11/extensions/Xinerama.h:49: error: `Display' was not
   declared in this scope
/usr/X11R6/include/X11/extensions/Xinerama.h:49: error: `dpy' was not declared
   in this scope
/usr/X11R6/include/X11/extensions/Xinerama.h:50: error: parse error before `*'
   token
/usr/X11R6/include/X11/extensions/Xinerama.h:55: error: `Display' was not
   declared in this scope
/usr/X11R6/include/X11/extensions/Xinerama.h:55: error: `dpy' was not declared
   in this scope
/usr/X11R6/include/X11/extensions/Xinerama.h:56: error: parse error before `*'
   token
/usr/X11R6/include/X11/extensions/Xinerama.h:61: error: `Display' was not
   declared in this scope
/usr/X11R6/include/X11/extensions/Xinerama.h:61: error: `dpy' was not declared
   in this scope
/usr/X11R6/include/X11/extensions/Xinerama.h:62: error: `Window' was not
   declared in this scope
/usr/X11R6/include/X11/extensions/Xinerama.h:62: error: parse error before `)'
   token
/usr/X11R6/include/X11/extensions/Xinerama.h:67: error: `Display' was not
   declared in this scope
/usr/X11R6/include/X11/extensions/Xinerama.h:68: error: `dpy' was not declared
   in this scope
/usr/X11R6/include/X11/extensions/Xinerama.h:68: error: 'Bool' is used as a
   type, but is not defined as a type.
/usr/X11R6/include/X11/extensions/Xinerama.h:72: error: `Display' was not
   declared in this scope
/usr/X11R6/include/X11/extensions/Xinerama.h:72: error: `dpy' was not declared
   in this scope
/usr/X11R6/include/X11/extensions/Xinerama.h:73: error: `Window' was not
   declared in this scope
/usr/X11R6/include/X11/extensions/Xinerama.h:73: error: parse error before `,'
   token
/usr/X11R6/include/X11/extensions/Xinerama.h:80: error: `Display' was not
   declared in this scope
/usr/X11R6/include/X11/extensions/Xinerama.h:80: error: `dpy' was not declared
   in this scope
/usr/X11R6/include/X11/extensions/Xinerama.h:81: error: parse error before `*'
   token
/usr/X11R6/include/X11/extensions/Xinerama.h:86: error: `Display' was not
   declared in this scope
/usr/X11R6/include/X11/extensions/Xinerama.h:86: error: `dpy' was not declared
   in this scope
/usr/X11R6/include/X11/extensions/Xinerama.h:87: error: `Window' was not
   declared in this scope
/usr/X11R6/include/X11/extensions/Xinerama.h:87: error: parse error before `,'
   token
/usr/X11R6/include/X11/extensions/Xinerama.h:93: error: `Display' was not
   declared in this scope
/usr/X11R6/include/X11/extensions/Xinerama.h:93: error: `dpy' was not declared
   in this scope
/usr/X11R6/include/X11/extensions/Xinerama.h:94: error: `Window' was not
   declared in this scope
/usr/X11R6/include/X11/extensions/Xinerama.h:94: error: parse error before `,'
   token
configure:18566: $? = 1
configure: failed program was:
| /* confdefs.h.  */
|
| #define PACKAGE_NAME ""
| #define PACKAGE_TARNAME ""
| #define PACKAGE_VERSION ""
| #define PACKAGE_STRING ""
| #define PACKAGE_BUGREPORT ""
| #define STDC_HEADERS 1
| #define HAVE_SYS_TYPES_H 1
| #define HAVE_SYS_STAT_H 1
| #define HAVE_STDLIB_H 1
| #define HAVE_STRING_H 1
| #define HAVE_MEMORY_H 1
| #define HAVE_STRINGS_H 1
| #define HAVE_INTTYPES_H 1
| #define HAVE_STDINT_H 1
| #define HAVE_UNISTD_H 1
| #define HAVE_LIBCRYPT 1
| #ifdef __cplusplus
| extern "C" void std::exit (int) throw (); using std::exit;
| #endif
| #define HAVE_X11_XAW_LABEL_H 1
| /* end confdefs.h.  */
| #include <stdio.h>
| #if HAVE_SYS_TYPES_H
| # include <sys/types.h>
| #endif
| #if HAVE_SYS_STAT_H
| # include <sys/stat.h>
| #endif
| #if STDC_HEADERS
| # include <stdlib.h>
| # include <stddef.h>
| #else
| # if HAVE_STDLIB_H
| #  include <stdlib.h>
| # endif
| #endif
| #if HAVE_STRING_H
| # if !STDC_HEADERS && HAVE_MEMORY_H
| #  include <memory.h>
| # endif
| # include <string.h>
| #endif
| #if HAVE_STRINGS_H
| # include <strings.h>
| #endif
| #if HAVE_INTTYPES_H
| # include <inttypes.h>
| #else
| # if HAVE_STDINT_H
| #  include <stdint.h>
| # endif
| #endif
| #if HAVE_UNISTD_H
| # include <unistd.h>
| #endif
| #include <X11/extensions/Xinerama.h>
configure:18589: result: no
configure:18593: checking X11/extensions/Xinerama.h presence
configure:18603: g++ -E   -I/usr/X11R6/include conftest.cc
configure:18609: $? = 0
configure:18629: result: yes
configure:18642: WARNING: X11/extensions/Xinerama.h: present but cannot be compiled
configure:18644: WARNING: X11/extensions/Xinerama.h:     check for missing prerequisite headers?
configure:18646: WARNING: X11/extensions/Xinerama.h: see the Autoconf documentation
configure:18648: WARNING: X11/extensions/Xinerama.h:     section "Present But Cannot Be Compiled"
configure:18650: WARNING: X11/extensions/Xinerama.h: proceeding with the preprocessor's result
configure:18652: WARNING: X11/extensions/Xinerama.h: in the future, the compiler will take precedence
configure:18664: checking for X11/extensions/Xinerama.h
configure:18671: result: yes
configure:18689: checking for XineramaIsActive in -lXinerama
configure:18719: g++ -o conftest -g -O2   -I/usr/X11R6/include   -L/usr/X11R6/lib conftest.cc -lXinerama -L/usr/X11R6/lib -lXext -lcrypt  >&5
configure:18725: $? = 0
configure:18729: test -z
                         || test ! -s conftest.err
configure:18732: $? = 0
configure:18735: test -s conftest
configure:18738: $? = 0
configure:18751: result: yes
configure:18831: checking for jakarta-ant
configure:18865: result: no
configure:18831: checking for ant
configure:18850: found /usr/local/apache-ant-1.6.5/bin/ant
configure:18862: result: /usr/local/apache-ant-1.6.5/bin/ant
configure:18890: checking if /usr/local/apache-ant-1.6.5/bin/ant works
configure:18915: /usr/local/apache-ant-1.6.5/bin/ant -buildfile conftest.xml 1>&2
Buildfile: conftest.xml

conftest:
    [javac] Compiling 1 source file

BUILD SUCCESSFUL
Total time: 2 seconds
configure:18918: $? = 0
configure:18921: result: Ant works
configure:18946: checking Ant lib directory
configure:18967: result: Ant lib directory found.
configure:18973: checking which languages to be built
configure:18980: result: ru en-US
configure:18985: checking which dictionaries to include
configure:18993: result: RURU,ENGB,ENUS
configure:18998: checking whether to statically link to Gtk
configure:19006: result: no
configure:19011: checking whether to use custom image sets
configure:19014: result: no
configure:19036: checking solver path
configure:19040: result: default
configure:19181: creating ./config.status

## ---------------------- ##
## Running config.status. ##
## ---------------------- ##

This file was extended by config.status, which was
generated by GNU Autoconf 2.59.  Invocation command line was

  CONFIG_FILES    =
  CONFIG_HEADERS  =
  CONFIG_LINKS    =
  CONFIG_COMMANDS =
  $ ./config.status

on uvv

config.status:846: creating set_soenv

## ---------------- ##
## Cache variables. ##
## ---------------- ##

ac_cv_build=i686-pc-linux-gnu
ac_cv_build_alias=i686-pc-linux-gnu
ac_cv_c_compiler_gnu=yes
ac_cv_cxx_compiler_gnu=yes
ac_cv_env_CC_set=
ac_cv_env_CC_value=
ac_cv_env_CFLAGS_set=
ac_cv_env_CFLAGS_value=
ac_cv_env_CPPFLAGS_set=
ac_cv_env_CPPFLAGS_value=
ac_cv_env_CPP_set=
ac_cv_env_CPP_value=
ac_cv_env_CXXCPP_set=
ac_cv_env_CXXCPP_value=
ac_cv_env_CXXFLAGS_set=
ac_cv_env_CXXFLAGS_value=
ac_cv_env_CXX_set=
ac_cv_env_CXX_value=
ac_cv_env_LDFLAGS_set=
ac_cv_env_LDFLAGS_value=
ac_cv_env_build_alias_set=
ac_cv_env_build_alias_value=
ac_cv_env_host_alias_set=
ac_cv_env_host_alias_value=
ac_cv_env_target_alias_set=
ac_cv_env_target_alias_value=
ac_cv_exeext=
ac_cv_func_connect=yes
ac_cv_func_gethostbyname=yes
ac_cv_func_remove=yes
ac_cv_func_shmat=yes
ac_cv_have_x='have_x=yes ac_x_includes=/usr/X11R6/include ac_x_libraries=/usr/X11R6/lib'
ac_cv_header_X11_Xaw_Label_h=yes
ac_cv_header_X11_extensions_Xinerama_h=yes
ac_cv_header_cups_cups_h=yes
ac_cv_header_fontconfig_fontconfig_h=yes
ac_cv_header_inttypes_h=yes
ac_cv_header_memory_h=yes
ac_cv_header_security_pam_appl_h=yes
ac_cv_header_stdc=yes
ac_cv_header_stdint_h=yes
ac_cv_header_stdlib_h=yes
ac_cv_header_string_h=yes
ac_cv_header_strings_h=yes
ac_cv_header_sys_stat_h=yes
ac_cv_header_sys_types_h=yes
ac_cv_header_unistd_h=yes
ac_cv_host=i686-pc-linux-gnu
ac_cv_host_alias=i686-pc-linux-gnu
ac_cv_lib_ICE_IceConnectionNumber=yes
ac_cv_lib_X11_XOpenDisplay=yes
ac_cv_lib_Xinerama_XineramaIsActive=yes
ac_cv_lib_c_gnu_get_libc_version=yes
ac_cv_lib_crypt_crypt=yes
ac_cv_objext=o
ac_cv_path_ANT=/usr/local/apache-ant-1.6.5/bin/ant
ac_cv_path_AWK=/usr/bin/gawk
ac_cv_path_BISON=/usr/bin/bison
ac_cv_path_COMPATH=/usr/bin/gcc
ac_cv_path_DMAKE=no
ac_cv_path_EPM=no
ac_cv_path_FLEX=/usr/bin/flex
ac_cv_path_JAVACOMPILER=/usr/lib/java/bin/javac
ac_cv_path_JAVADOC=/usr/lib/java/bin/javadoc
ac_cv_path_JAVAINTERPRETER=/usr/lib/java/bin/java
ac_cv_path_MOC=/usr/lib/qt/bin/moc
ac_cv_path_PATCH=/usr/bin/patch
ac_cv_path_PERL=/usr/bin/perl
ac_cv_path_PKG_CONFIG=/usr/bin/pkg-config
ac_cv_path_SED=/usr/bin/sed
ac_cv_path_TCSH=/bin/tcsh
ac_cv_path_XMKMF=/usr/X11R6/bin/xmkmf
ac_cv_path_ZIP=/usr/bin/zip
ac_cv_prog_AWK=gawk
ac_cv_prog_CPP='gcc -E'
ac_cv_prog_CXXCPP='g++ -E'
ac_cv_prog_ac_ct_CC=gcc
ac_cv_prog_ac_ct_CXX=g++
ac_cv_prog_cc_g=yes
ac_cv_prog_cc_stdc=
ac_cv_prog_cxx_g=yes
ac_cv_prog_egrep='grep -E'
ac_cv_target=i686-pc-linux-gnu
ac_cv_target_alias=i686-pc-linux-gnu

## ----------------- ##
## Output variables. ##
## ----------------- ##

ANT='/usr/local/apache-ant-1.6.5/bin/ant'
ANT_HOME='/usr/local/apache-ant-1.6.5'
ANT_LIB='/usr/local/apache-ant-1.6.5/lib'
ASM_HOME='NO_ASM_HOME'
AWK='/usr/bin/gawk'
AWTLIB=''
BISON='/usr/bin/bison'
BUILD_DMAKE='YES'
BUILD_EPM='YES'
BUILD_MOZAB='TRUE'
BUILD_TYPE='OOo EXT BINFILTER DICTIONARIES EPM ODK QADEVOOO ZLIB JPEG EXPAT FREETYPE LIBWPD LIBXML2 LIBXMLSEC PYTHON CURL BOOST UNIXODBC MOZ SANE X11_EXTENSIONS NAS SNDFILE PORTAUDIO NEON MSFONTEXTRACT MATHMLDTD BITSTREAM_VERA_FONTS'
BUILD_VER_STRING=''
CC='gcc'
CFLAGS=' -I/usr/X11R6/include'
COMEX=''
COMPATH='/usr/bin'
CPP='gcc -E'
CPPFLAGS='  -I/usr/X11R6/include'
CRYPT_LINK='YES'
CSC_PATH=''
CURLCONFIG=''
CURL_CFLAGS=''
CURL_LIBS=''
CUSTOM_IMAGE_SETS=''
CXX='g++'
CXXCPP='g++ -E'
CXXFLAGS='-g -O2'
CYGWIN_PATH='NO_CYGWIN'
DB_INCLUDES=''
DB_JAR=''
DB_VERSION=''
DEFS='-DPACKAGE_NAME=\"\" -DPACKAGE_TARNAME=\"\" -DPACKAGE_VERSION=\"\" -DPACKAGE_STRING=\"\" -DPACKAGE_BUGREPORT=\"\" -DSTDC_HEADERS=1 -DHAVE_SYS_TYPES_H=1 -DHAVE_SYS_STAT_H=1 -DHAVE_STDLIB_H=1 -DHAVE_STRING_H=1 -DHAVE_MEMORY_H=1 -DHAVE_STRINGS_H=1 -DHAVE_INTTYPES_H=1 -DHAVE_STDINT_H=1 -DHAVE_UNISTD_H=1 -DHAVE_LIBCRYPT=1 -DHAVE_X11_XAW_LABEL_H=1 -DHAVE_LIBXINERAMA=1 '
DIRECTXSDK_HOME=''
DIRECTXSDK_LIB=''
DMAKE='no'
DPKG=''
ECHO_C=''
ECHO_N='-n'
ECHO_T=''
EGREP='grep -E'
ENABLE_CRASHDUMP=''
ENABLE_CUPS='TRUE'
ENABLE_DEBUG='FALSE'
ENABLE_DIRECTX=''
ENABLE_EVOAB2=''
ENABLE_FONTCONFIG='TRUE'
ENABLE_GNOMEVFS='TRUE'
ENABLE_GTK='TRUE'
ENABLE_KDE='TRUE'
ENABLE_NAS='YES'
ENABLE_PASF='YES'
ENABLE_RPATH='yes'
ENABLE_STATIC_GTK='FALSE'
ENABLE_SYMBOLS=''
ENABLE_VCTK=''
EPM='no'
EXCEPTIONS='dwarf2'
EXEEXT=''
EXTRA_DOTNET_FILES=''
FLEX='/usr/bin/flex'
FRAME_HOME=''
FREETYPE_CFLAGS=''
FREETYPE_LIBS=''
GCCVER='30304'
GCC_HOME='/usr'
GCONF_CFLAGS='-DORBIT2=1 -pthread -I/usr/include/gconf/2 -I/usr/include/orbit-2.0 -I/usr/include/glib-2.0 -I/usr/lib/glib-2.0/include  '
GCONF_LIBS='-pthread -Wl,--export-dynamic -lgconf-2 -lORBit-2 -lgobject-2.0 -lm -lgmodule-2.0 -ldl -lgthread-2.0 -lglib-2.0  '
GDKPIXBUF_CFLAGS='-I/usr/include/gtk-2.0 -I/usr/include/glib-2.0 -I/usr/lib/glib-2.0/include  '
GDKPIXBUF_LIBS='-Wl,--export-dynamic -lgdk_pixbuf_xlib-2.0 -lgdk_pixbuf-2.0 -lm -lgobject-2.0 -lgmodule-2.0 -ldl -lglib-2.0  '
GNOMEVFS_CFLAGS='-pthread -DORBIT2=1 -I/usr/include/gnome-vfs-2.0 -I/usr/lib/gnome-vfs-2.0/include -I/usr/include/bonobo-activation-2.0 -I/usr/include/glib-2.0 -I/usr/lib/glib-2.0/include -I/usr/include/orbit-2.0  '
GNOMEVFS_LIBS='-pthread -Wl,--export-dynamic -lgnomevfs-2 -lbonobo-activation -lORBit-2 -lgobject-2.0 -lm -lgmodule-2.0 -ldl -lgthread-2.0 -lglib-2.0  '
GNUCP=''
GNUMAKE='make'
GNUPATCH=''
GOBJECT_CFLAGS=''
GOBJECT_LIBS=''
GTK_CFLAGS='-I/usr/include/gtk-2.0 -I/usr/lib/gtk-2.0/include -I/usr/include/atk-1.0 -I/usr/include/pango-1.0 -I/usr/X11R6/include -I/usr/include/freetype2 -I/usr/include/glib-2.0 -I/usr/lib/glib-2.0/include   -I/usr/include/gtk-2.0 -I/usr/include/glib-2.0 -I/usr/lib/glib-2.0/include  '
GTK_LIBS='-Wl,--export-dynamic -lgtk-x11-2.0 -lgdk-x11-2.0 -latk-1.0 -lgdk_pixbuf-2.0 -lm -lpangoxft-1.0 -lpangox-1.0 -lpango-1.0 -lgobject-2.0 -lgmodule-2.0 -ldl -lglib-2.0   -Wl,--export-dynamic -lgdk_pixbuf_xlib-2.0 -lgdk_pixbuf-2.0 -lm -lgobject-2.0 -lgmodule-2.0 -ldl -lglib-2.0  '
GXX_INCLUDE_PATH='/usr/include/c++/3.3.4'
HAVE_GCC_VISIBILITY_FEATURE=''
JAVACACHE=''
JAVACOMPILER='/usr/lib/java/bin/javac'
JAVADOC='/usr/lib/java/bin/javadoc'
JAVAINTERPRETER='/usr/lib/java/bin/java'
JAVA_HOME='/usr/lib/java'
JDK=''
KDE_CFLAGS='-I/usr/lib/qt/include -I/opt/kde/include -DQT_CLEAN_NAMESPACE -DQT_NO_EMIT -DQT_THREAD_SUPPORT'
KDE_LIBS='-L/opt/kde/lib -L/usr/lib/qt/lib -lkdeui -lkdecore -lqt-mt'
LANG='en_US'
LDFLAGS='  -L/usr/X11R6/lib'
LIBART_CFLAGS=''
LIBART_LIBS=''
LIBOBJS=''
LIBS='-lXinerama -lcrypt '
LIBSN_CFLAGS=''
LIBSN_LIBS=''
LIBWPD_CFLAGS=''
LIBWPD_LIBS=''
LIBXML_CFLAGS=''
LIBXML_LIBS=''
LOCAL_SOLENV='DEFAULT'
LOCAL_SOLVER='DEFAULT'
LTLIBOBJS=''
MIDL_PATH=''
ML_EXE=''
MOC='/usr/lib/qt/bin/moc'
MOZILLAXPCOM_CFLAGS=''
MOZILLAXPCOM_LIBS=''
MOZILLA_TOOLKIT='gtk2'
MOZILLA_VERSION='1.7.5'
MOZLIBREQ_CFLAGS='-I/usr/include/libIDL-2.0 -I/usr/include/glib-2.0 -I/usr/lib/glib-2.0/include  '
MOZLIBREQ_LIBS='-lIDL-2 -lglib-2.0  '
MOZ_INC=''
MOZ_LDAP_CFLAGS=''
MOZ_LIB=''
MOZ_LIB_XPCOM=''
MOZ_NSS_CFLAGS=''
MOZ_NSS_LIBS=''
MSPDB_PATH=''
MYSPELL_CFLAGS=''
MYSPELL_LIBS='-lmyspell'
NAS_INCLUDES=''
NEON_CFLAGS=''
NEON_LIBS='-lneon'
NETTOOLKIT=''
NMAKE_PATH=''
NSIS_PATH=''
OBJEXT='o'
OSVERSION=''
PACKAGE_BUGREPORT=''
PACKAGE_NAME=''
PACKAGE_STRING=''
PACKAGE_TARNAME=''
PACKAGE_VERSION=''
PAM_LINK='NO'
PATCH='/usr/bin/patch'
PATH_SEPARATOR=':'
PERL='/usr/bin/perl'
PKGFORMAT='rpm'
PKGMK=''
PKG_CONFIG='/usr/bin/pkg-config'
PRODUCT='full'
PROEXT='.pro'
PROFULLSWITCH='product=full'
PSDK_HOME=''
PTHREAD_CFLAGS=''
PTHREAD_LIBS=''
PYTHON=''
PYTHON_CFLAGS=''
PYTHON_EXEC_PREFIX=''
PYTHON_LIBS=''
PYTHON_PLATFORM=''
PYTHON_PREFIX=''
PYTHON_VERSION=''
RPM='rpmbuild'
SABLOTCONFIG=''
SABLOT_LIBS=''
SCPDEFS=''
SED='/usr/bin/sed'
SHELL='/bin/sh'
SOLAR_JAVA='TRUE'
SOURCEVERSION='OOO680'
STLPORT4='NO_STLPORT4'
SYSTEM_BOOST='NO'
SYSTEM_CURL='NO'
SYSTEM_DB='NO'
SYSTEM_EXPAT='NO'
SYSTEM_FREETYPE='NO'
SYSTEM_HYPH='NO'
SYSTEM_JPEG='NO'
SYSTEM_LIBWPD='NO'
SYSTEM_LIBXML='NO'
SYSTEM_MOZILLA='NO'
SYSTEM_MSPACK='NO'
SYSTEM_MYSPELL='NO'
SYSTEM_MYTHES='NO'
SYSTEM_NAS='NO'
SYSTEM_NEON='NO'
SYSTEM_ODBC_HEADERS='NO'
SYSTEM_PORTAUDIO='NO'
SYSTEM_PYTHON='NO'
SYSTEM_SABLOT='NO'
SYSTEM_SANE_HEADER='NO'
SYSTEM_SNDFILE='NO'
SYSTEM_STDLIBS='NO'
SYSTEM_XRENDER_HEADERS='NO'
SYSTEM_ZLIB='NO'
TCSH='/bin'
UPD='680'
USE_SHELL='tcsh'
USE_SYSTEM_STL=''
USE_XINERAMA='YES'
VC_STANDARD=''
WITH_BINFILTER='YES'
WITH_DICT=',RURU,ENGB,ENUS,'
WITH_FONTOOO='YES'
WITH_FONTS='YES'
WITH_GPC='NO'
WITH_LANG='ru en-US'
WITH_LIBART='NO'
WITH_LIBSN='NO'
WITH_MINGWIN='0'
WITH_MOZILLA='YES'
WITH_MYSPELL_DICTS='YES'
WITH_OPENLDAP='NO'
XINC='/usr/X11R6/include'
XINERAMA_LINK='static'
XLIB='/usr/X11R6/lib'
XMKMF='/usr/X11R6/bin/xmkmf'
XRENDER_LINK='NO'
XSLTPROC='NO_XSLTPROC'
X_CFLAGS=' -I/usr/X11R6/include'
X_EXTRA_LIBS=''
X_LIBS=' -L/usr/X11R6/lib'
X_PRE_LIBS=' -lSM -lICE'
ZIP='/usr/bin/zip'
ZIP_HOME='/usr/bin'
_cc=''
ac_ct_CC='gcc'
ac_ct_CXX='g++'
bindir='${exec_prefix}/bin'
build='i686-pc-linux-gnu'
build_alias=''
build_cpu='i686'
build_os='linux-gnu'
build_vendor='pc'
datadir='${prefix}/share'
exec_prefix='${prefix}'
host='i686-pc-linux-gnu'
host_alias=''
host_cpu='i686'
host_os='linux-gnu'
host_vendor='pc'
includedir='${prefix}/include'
infodir='${prefix}/info'
libdir='${exec_prefix}/lib'
libexecdir='${exec_prefix}/libexec'
localstatedir='${prefix}/var'
mandir='${prefix}/man'
oldincludedir='/usr/include'
pkgpyexecdir=''
pkgpythondir=''
prefix='/usr/local'
program_transform_name='s,x,x,'
pyexecdir=''
pythondir=''
sbindir='${exec_prefix}/sbin'
sharedstatedir='${prefix}/com'
sysconfdir='${prefix}/etc'
target='i686-pc-linux-gnu'
target_alias=''
target_cpu='i686'
target_os='linux-gnu'
target_vendor='pc'

## ----------- ##
## confdefs.h. ##
## ----------- ##

#define HAVE_INTTYPES_H 1
#define HAVE_LIBCRYPT 1
#define HAVE_LIBXINERAMA 1
#define HAVE_MEMORY_H 1
#define HAVE_STDINT_H 1
#define HAVE_STDLIB_H 1
#define HAVE_STRINGS_H 1
#define HAVE_STRING_H 1
#define HAVE_SYS_STAT_H 1
#define HAVE_SYS_TYPES_H 1
#define HAVE_UNISTD_H 1
#define HAVE_X11_XAW_LABEL_H 1
#define PACKAGE_BUGREPORT ""
#define PACKAGE_NAME ""
#define PACKAGE_STRING ""
#define PACKAGE_TARNAME ""
#define PACKAGE_VERSION ""
#define STDC_HEADERS 1
#endif
#ifdef __cplusplus
extern "C" void std::exit (int) throw (); using std::exit;

configure: exit 0


---------------------------------------------------------------------
To unsubscribe, e-mail: [hidden email]
For additional commands, e-mail: [hidden email]
Reply | Threaded
Open this post in threaded view
|

Re: error when building progect sal

Yurkov Vyacheslav
Yurkov Vyacheslav пишет:

> I'm sorry for incomplete information that I gave before (I forgot
> about redirection stderr ;)!
> My OS is Slackware 10, gcc-3.3.4
>
> =============
> Building project sal
> =============
> /mnt/oo/OOo_2.0.0rc3_src/sal/typesconfig
> -------------
> /mnt/oo/OOo_2.0.0rc3_src/sal/osl/all
> -------------
> /mnt/oo/OOo_2.0.0rc3_src/sal/osl/unx
> -------------
> /mnt/oo/OOo_2.0.0rc3_src/sal/rtl/source
> --- ALWAYSDBGFILES ---
> `../../unxlngi4.pro/slo/debugprint.obj' is up to date
> --- ALWAYSDBGFILES OVER ---
> -------------
> /mnt/oo/OOo_2.0.0rc3_src/sal/systools/macxp_extras/x11osx
> Nothing to build for OS LINUX
> /mnt/oo/OOo_2.0.0rc3_src/sal/textenc
> -------------
> /mnt/oo/OOo_2.0.0rc3_src/sal/util
> ------------------------------
> Making: ../unxlngi4.pro/lib/libsalalloc_malloc.so.3
> gcc -z combreloc -z defs -Wl,-rpath,'$ORIGIN'
> "-Wl,-hlibsalalloc_malloc.so.3" -shared -Wl,-O1 -Wl,--version-script
> ../unxlngi4.pro/misc/salalloc_salalloc_malloc.map
> -L../unxlngi4.pro/lib -L../lib
> -L/mnt/oo/OOo_2.0.0rc3_src/solenv/unxlngi4/lib
> -L/mnt/oo/OOo_2.0.0rc3_src/solver/680/unxlngi4.pro/lib
> -L/mnt/oo/OOo_2.0.0rc3_src/solenv/unxlngi4/lib -L/usr/lib/java/lib
> -L/usr/lib/java/jre/lib/i386 -L/usr/lib/java/jre/lib/i386/client
> -L/usr/lib/java/jre/lib/i386/native_threads -L/usr/X11R6/lib
> ../unxlngi4.pro/slo/salalloc_malloc_version.o
> ../unxlngi4.pro/slo/salalloc_malloc_description.o -o
> ../unxlngi4.pro/lib/libsalalloc_malloc.so.3
> ../unxlngi4.pro/slo/SYSALLOC_alloc.o -ldl -lpthread -lm
> rm -f ../unxlngi4.pro/lib/check_libsalalloc_malloc.so.3
> mv ../unxlngi4.pro/lib/libsalalloc_malloc.so.3
> ../unxlngi4.pro/lib/check_libsalalloc_malloc.so.3
> /mnt/oo/OOo_2.0.0rc3_src/solenv/bin/checkdll.sh -L../unxlngi4.pro/lib
> -L../lib -L/mnt/oo/OOo_2.0.0rc3_src/solenv/unxlngi4/lib
> -L/mnt/oo/OOo_2.0.0rc3_src/solver/680/unxlngi4.pro/lib
> -L/mnt/oo/OOo_2.0.0rc3_src/solenv/unxlngi4/lib -L/usr/lib/java/lib
> -L/usr/lib/java/jre/lib/i386 -L/usr/lib/java/jre/lib/i386/client
> -L/usr/lib/java/jre/lib/i386/native_threads -L/usr/X11R6/lib
> ../unxlngi4.pro/lib/check_libsalalloc_malloc.so.3
> Checking DLL ../unxlngi4.pro/lib/check_libsalalloc_malloc.so.3
> .../mnt/oo/OOo_2.0.0rc3_src/solenv/bin/checkdll.sh: line 67:  7705
> Segmentation fault      $checkdll "$*"
> dmake:  Error code 1, while making
> '../unxlngi4.pro/lib/libsalalloc_malloc.so.3'
> '---* tg_merge.mk *---'
>
> ERROR: Error 65280 occurred while making
> /mnt/oo/OOo_2.0.0rc3_src/sal/util
> dmake:  Error code 1, while making 'build_instsetoo_native'
> '---* tg_merge.mk *---'
>
>------------------------------------------------------------------------
>
>---------------------------------------------------------------------
>To unsubscribe, e-mail: [hidden email]
>For additional commands, e-mail: [hidden email]
>

If someone interesting, my mistake is than I forgot to run tcsh shell.

--
If my english isn't correct, please tell me where, cause I just study!